yearrt,med,maxeso,gender,intake_who,age,chemo,ott,chemo3g,gtv1,tumorload,toxeso,toxesohigh2,pretoxeso,dose per fraction,fractions,total dose,second dose per fracion,second fractions,second total dose,BED,Modality,PacksPerDay,SmokingStatus,IsSCLC,T_stage,N_stage,M_stage,PA,Locatie,FEV,CumultativeTotalTumorDose,meanlungdose,lungv20,CumOTT,OverallBaselineDysp,OverallPostRTDyspFullScore,DyspGT2,DeltaDyspGe1,TreatmentType,TwoYearSurvival
2010,17.0346,44.8989,0,2,67,1,21,2, ,52.5055,2,0,2, , , , , , , ,0, , ,0,0,2,0,0,1,97,45,15.4178,33.8485,21,0,0,0,0, ,0
2014, , ,0,1,69, ,36, , , ,2,0,2,1.5,30,45,2,11,22,78.15,2, ,1,0,3,2,0,1,0,61,67, , ,36,1,1,0,0,2,0
2010, , ,1,1,82, ,24, , , ,1,0,0, , , , , , , ,1, ,1,0,1,3,0,1,0, ,52.25, , ,24,0,1,0,1, ,0
2013,17.2298,48.9217,1,1,77,1,36,2, ,42.2745,1,0,1,2,22,33, , , ,52.8,2, ,1,0,1,3,0,1,0,91,69,25.0428,11.9888,36,1,1,0,0,2,0
2013, , ,1,2,83, ,28, , , ,0,0,0,1.8,40,72, , , ,84.96,2, ,1,0,1,2,0,1,2, ,72, , ,28,2,2,0,0,2,0
2011, , ,0,1,86,0,17,0, , ,3,1,3, , , , , , , ,1, ,1,0,3,2,0,1,2,89,44.92, , ,17,1,1,0,0, ,0
2007,4.99,18.44,1,0,77,0,29,0,4.92,4.92,0,0, , , , , , , , ,1, , ,0,0,0,0,1,2, ,79.2, , ,29, ,1,0, , ,1
2007, , ,1, ,59, ,33, , , ,0,0,0, , , , , , , ,1, , ,0,3,0,0,1,2, ,65, , ,33, ,1,0, , ,1
 , , ,0, ,63, ,33, , , , , , , , , , , , , ,0, , ,0,3,0,0,1,2, ,65, , ,33, ,0,0, , ,1
2008, , ,1, ,67, ,26, , , ,2,0,1, , , , , , , ,1, , ,0,0,2,0,1,2, ,57, , ,26, ,1,0, , ,1
2008, , ,0, ,65, ,26, , , ,1,0,0, , , , , , , ,1, , ,0,1,2,0,1,0, ,61, , ,26, ,2,0, , ,1
2008,11.13,32.02,1,2,86,0,33,0,28.99,28.99,1,0, , , , , , , , ,1, , ,0,1,0,0,1,2, ,70.2, , ,32, ,0,0, , ,1
2011, , ,0, ,42, ,21, , , ,1,0,1, , , , , , , ,2, ,1,0,1,3,0,0,2, ,45, , ,21, ,0,0, , ,1
2008, , ,1, ,70, ,27, , , ,0,0,0,1.8,29,52.2, , , ,61.596,2, , ,0,0,3,0,1,0, ,57, , ,27, ,0,0, , ,1
2008,22.66,58.55,1,1,73,1,22,1,61.94,61.94,1,0, ,2.75,24,66, , , ,84.15,0, ,1,0,3, ,0,1,2, ,59.4, , ,22, ,1,0, , ,1
2013, , ,0, ,53, ,20, , , ,0,0,0,1.8,38,68.4, , , ,80.712,2, ,2,0,3,1,0,0,0, ,45, , ,20, ,0,0, , ,1
2008, , ,1, ,65, ,18, , , ,0,0,0,1.8,30,54, , , ,63.72,0, , ,0,1,3,0, ,2, ,54, , ,18, ,0,0, , ,1
2008, , ,1,1,62,1,26,1, , ,0,0,0, , , , , , , ,0, , ,0,3,2, ,1, , ,66.6, , ,26, ,0,0, , ,1
2008, , ,0, ,53, ,35, , , ,0,0,0, , , , , , , ,0, , ,0, , , ,1,2, ,69, , ,35, ,1,0, , ,1
2008, , ,0,0,66,1,34,2, , ,0,0,0, , , , , , , ,0, , ,0,1,3,0,1,2,90,65, , ,34, ,0,0, , ,0
2008, , ,1,1,70,1,38,2, , ,0,0,0, , , , , , , ,0, , ,0,0,0,0,1,2, ,69, , ,38, ,0,0, , ,1
2009, , ,0, ,63,1,30,2, , ,0,0,0, , , , , , , ,0, , ,0,1,3,0,1,0,85,61, , ,30, ,1,0, , ,1
2008, , ,1,1,63,1,37,2, , ,0,0,0, , , , , , , ,0, , ,0,3,0,0,1,3,88,69, , ,37, ,0,0, , ,1
2009, , ,1,1,59,0,25,0, , ,0,0,0, , , , , , , ,0, , ,0,1,0,0,1,2,93,68.4, , ,25, ,0,0, , ,1
2008, , ,0,0,62,1,23,2, , ,0,0,0, , , , , , , ,0, , ,0,3,2,0,1, ,81,53, , ,23, ,0,0, , ,1
2009, , ,1,0,62, ,22, , , ,0,0,0, , , , , , , ,0, , ,0,3,3,0,1, ,75,57, , ,22, ,0,0, , ,0
2009, , ,1,0,63, ,32, , , ,0,0,0, , , , , , , ,0, , ,0,0,0,0,1,2,86,57, , ,32, ,3,1, , ,1
2009, , ,1,0,67,1,34,2, , ,0,0,0,1.8,44,79.2, , , ,93.456,0, ,1,0,3,0,0,1,2,69,69, , ,34, ,1,0, , ,1
2009, , ,0,1,57,1,27,1, , ,0,0,0, , , , , , , ,0, , ,0,3,3,0,1,2,67,57, , ,27, ,0,0, , ,1
2012, , ,1,2,69,1,28,2, , ,0,0,0,1.8,44,79.2, , , ,93.456,2,1,1,0,2,0,0,1,2,60,53, , ,28, ,1,0, , ,1
2009, , ,1,0,73,0,38,0, , ,0,0,0, , , , , , , ,2, , ,0,1,2,0,1,2,102,69, , ,38, ,1,0, , ,1
2009, , ,0, ,73, ,24, , , ,0,0,0, , , , , , , ,0, , ,0,3,3,0,1, , ,61.2, , ,24, ,0,0, , ,0
2009, , ,1,0,59,1,19,2, , ,0,0,0, , , , , , , ,0, , ,0,1,2,0,0,0,77,45, , ,19, ,0,0, , ,0
2009,17.77,46.4055,1,0,77,1,36,2, ,52.0506,0,0,0, , , , , , , ,0, , ,0,3,0,0,1,2,75,69.01,14.9817,19.37,36, ,0,0, , ,1
2009,13.8312,46.8169,1,2,76,1,33,2, ,59.7296,0,0,0, , , , , , , ,0, , ,0,0,3,0,1,2,66,69,14.9404,20.7571,33, ,0,0, , ,1
2009,18.687,48.1371,1,1,72,1,37,2, ,68.1982,0,0,0, , , , , , , ,0, , ,0,3,2,0,1,2,92,69,14.6451,19.111,37, ,0,0, , ,1
2009,39.8938,73.8651,1,1,70, ,25, , ,144.2013,0,0,0, , , , , , , ,0, , ,0,2,2,0,1, ,73.2,70.2,18.7823,30.6255,25, ,0,0, , ,0
2009,12.7193,44.7503,1,1,57,1,36,2, , ,0,0,0, , , , , , , ,0, , ,0,1,2,0,1,0,97,69,14.5772,12.2062,36, ,1,0, , ,1
2009, , ,1,0,78,0,27,0, ,149.2081,0,0,0, , , , , , , ,1, , ,0,2,0,0,1,0,117,70.2,13.3387,18.2778,27, ,0,0, , ,1
2009,9.8179,20.3823,1,0,84, ,30, , ,117.5995,0,0,0, , , , , , , ,1, , ,0,2,0,0,1,0,98,79.2,18.012,29.8858,30, ,0,0, , ,1
2009,3.8511,19.6779,1,0,64, ,27, , ,18.1074,0,0,0, , , , , , , ,1, , ,0,1,0,0,1,0, ,70.2,12.7363,23.1565,27, ,1,0, , ,1
2013,8.9368,41.8705,1,1,84,0,32,0, ,34.5325,0,0,0,1.8,42,75.6, , , ,89.208,2, ,1,0,1,0,0, ,2,73,75.6,11.162,19.3541,32,1,1,0,0,2,1
2009, , ,1,1,75,1,36,2, ,114.9845,0,0,0, , , , , , , ,0, , ,0,3,2,0,1,2,107,69,12.5904,8.6269,36, ,0,0, , ,0
2009,10.9118,41.7957,0,4,60,1,36,2, ,16.2277,0,0,0, , , , , , , ,0, , ,0,1,2,0,1,2,96,69,22.4566,23.3896,36, ,0,0, , ,0
2009,7.3772,24.5217,1,0,68,1,34,2, ,176.2877,0,0,0, , , , , , , ,0, , ,0,3,0,0,1,2,93,65,27.539,29.775,34, ,0,0, , ,0
2009,23.4042,45.8545,0,0,52,1,22,2, ,59.9356,0,0,0, , , , , , , ,2, , ,0,3,3,0,1,2,122,55,32.6124,36.5187,22, ,0,0, , ,1
2009, , ,0,0,63,1,37,2, , ,0,0,0, , , , , , , ,0, , ,0,3,2,0,1,2,76,69, , ,37, ,0,0, , ,1
2009, , ,1,2,69, ,1, , ,188.2782,3,1,0, , , , , , , ,1, , ,0,3,3,0,1, ,78,10,1.5949,0,1, ,2,0, , ,0
2009,29.0732,68.8493,0,0,77,1,24,1, ,26.9709,1,0,0, , , , , , , ,1, , ,0,1,3,0,1,0,112,63,20.657,34.9048,24, ,0,0, , ,0
2009,13.6307,44.4299,0,1,53,1,37,2, ,95.6783,0,0,0, , , , , , , ,0, , ,0,3,2,0,1,2,72,63,15.8345,24.2106,37, ,0,0, , ,0
2009,24.7096,57.9602,1,1,71,1,40,2, ,115.8772,0,0,0, , , , , , , ,1, , ,0,3,3,0, ,2,75,55,33.6864,38.0289,40, ,0,0, , ,0
2009,13.7163,44.1812,0,0,52,1,41,2, ,48.1768,0,0,0, , , , , , , ,0, , ,0,1,3,0,1,2, ,69,15.5605,19.9864,41, ,1,0, , ,0
2009, , ,1,2,68,1,36,2, , ,0,0,0, , , , , , , ,0, , ,0,0,2,0,1,2,57,69, , ,36, ,0,0, , ,0
2009, , ,0,1,53,1,35,2, , ,2,0,0, , , , , , , ,0, , ,0,3,2,0,1,2,90,69, , ,35, ,0,0, , ,1
2009,38.7282,69.1644,1,1,78, ,28, , ,204.6719,3,1,0, , , , , , , ,1, , ,0,2,0,0,1,0,82,70.2,19.7575,31.0107,28, ,1,0, , ,1
2009,16.244,47.4787,0,2,64,1,29,2, ,310.0519,0,0,0, , , , , , , ,0, , ,0,2,3,0,1,2,108,61,25.5686,25.7517,29, ,2,0, , ,0
2009,35.2832,46.9416,0,0,53,1,29,2, ,88.3913,3,1,0, , , , , , , ,0, , ,0,0,3,0,1,0,83,55.04,19.8578,28.6926,29, ,1,0, , ,1
2009, , ,1,3,72,0,35,0, ,70.7417,0,0,0, , , , , , , ,1, , ,0,2,0,0,1,2,85,61.01,11.3676,9.1795,35, ,0,0, , ,1
2009,17.9252,48.3299,1,1,77,1,39,2, ,70.8733,1,0,1,4,5,20, , , ,28,2, , ,0,1,2, ,1,0, ,69,17.805,19.0349,39, ,1,0, , ,1
2010,38.0417,64.8105,0,1,79,1,22,1, ,209.7101,2,0,0, , , , , , , ,1, , ,0,3,3,0,1,2,58,61.2,19.1929,34.6609,22,1,1,0,0, ,0
2009,5.2238,8.3286,1,0,58,1,26,2, ,516.7322,2,0,0, , , , , , , ,0, , ,0,3,3,0,1,2,77,55,15.2166,25.1821,26, ,0,0, , ,0
2009,10.6046,41.5501,0,0,47,1,37,2, ,60.0529,0,0,0, , , , , , , ,0, , ,0,3,2,0,1,2,97,69,13.6118,15.9583,37, ,0,0, , ,0
2009,14.5773,45.3643,1,2,52, ,41, , ,205.0037,1,0,1,4,5,20, , , ,28,2, , ,0, , ,0,1,2,52,69,10.7135,3.916,41, ,1,0, , ,1
2009,19.2384,39.9788,1,0,80,1,39,2, ,28.0094,2,0,0, , , , , , , ,0, , ,0,1,2,0,1,0,76,65,19.4695,29.1908,39, ,4,1, , ,0
2010,22.8662,68.631,1,3,79,1,47,1, ,9.9106,2,0,0, , , , , , , ,1, , ,0,3,0,0,1,0, ,66,12.1737,21.5983,47,1,1,0,0, ,1
2010,23.8934,46.3948,1,1,68,1,27,2, ,131.8502,3,1,1, , , , , , , ,0, , ,0,1,3,0,1,0, ,57,19.9708,33.4278,27,0,0,0,0, ,0
2010,30.5577,47.6117,1,1,75,1,29,2, ,706.913,2,0,2, , , , , , , ,0, , ,0,3,1,0,1,2,71,57,17.2715,17.4005,29,0,0,0,0, ,1
2009,24.0287,72.6419,1,0,57,0,27,0, ,25.9895,0,0,0, , , , , , , ,1, , ,0,2,0,0,1,0,83,70.24,22.8004,21.2993,27, ,1,0, , ,0
2009,36.915,59.0364,1,1,70,1,28,2, ,107.1539,2,0,0, , , , , , , ,1, , ,0,1,3, ,1,1, ,54,19.8628,39.9706,28, ,0,0, , ,0
2010,19.2363,47.8425,1,1,61,1,34,2, ,183.7778,3,1,3, , , , , , , ,0, , ,0,3,2,0,1,0,77,67, ,27.196,34, ,1,0, , ,0
2010,9.5487,15.8732,1,0,71,1,30,2, ,216.5937,2,0,2, , , , , , , ,1, , ,0,3,2, , ,2,112,61.11,18.8448,23.9037,30,0,1,0,1, ,0
2010,30.8932,64.4315,1,1,81, ,28, , , ,1,0,0, , , , , , , ,1, , ,0,1,2,0,1,1,30,70.17,19.5309,37.9464,28,0,2,0,1, ,0
2010,16.185,42.9957,0,1,55,1,37,2, ,32.8445,1,0,1, , , , , , , ,0, , ,0,3,2, ,1,2,83,69.1, ,14.783,37,0,0,0,0, ,1
2010,9.3108,14.4501,1,0,70,1,32,2, ,174.7942,3,1,2, , , , , , , ,1, , ,0,2,3,0,1,2,80,59,9.3832,0,32,0,1,0,1, ,0
2010,26.2287,45.2206,1,2,63,1,1,2, ,170.6457,1,0,1, , , , , , , ,0, , ,0,1,2,0,1,2, ,3,13.9412,27.1903,1,0,0,0,0, ,0
2010, , ,1,3,79,0,33,0, , ,1,0,0, , , , , , , ,1, , ,0,0,0,0,1,0, ,66, , ,33,3,2,0,0, ,1
2010,37.1855,48.8897,0,0,65, ,31, , ,17.7927,2,0,1, , , , , , , ,0, , ,0,1,2,0,1,2,74,59,19.9461,33.5039,31,0,0,0,0, ,0
2010,20.1171,46.16,0,1,53,1,36,2, , ,2,0,3, , , , , , , ,0, , ,0, ,2,0,1, ,103,69,13.6312,13.2349,36,0,0,0,0, ,0
2010,9.0645,27.2732,1,1,62,0,34,0, ,107.0824,0,0,0, , , , , , , ,2, , ,0,3,2,0,1,2,109,65,27.6166,28.1319,34,0,2,0,1, ,1
2010,5.349,13.6409,1,0,72,1,39,2, ,202.1055,1,0,1, , , , , , , ,0, , ,0,2,0,0,1,0,69,69,19.1019,23.7927,39,0,0,0,0, ,0
2010, , ,0,1,47,1,35,2, ,36.6526,3,1,1, , , , , , , ,0, , ,0,1,2,0,1, ,91,67,19.9672,28.3098,35,1,1,0,0, ,1
2010,20.9758,30.3436,1,2,57, ,13, , ,100.6336,0,0,0, , , , , , , ,0, , ,0,3,3, ,1,1, ,27,17.6386,50.9581,13,2,2,0,0, ,0
2010,14.4701,47.5154,1,2,63,1,41,2, ,120.3833,1,0,0, , , , , , , ,0, , ,0,3,2, ,1,2,83,69,17.096,11.7173,41,0,1,0,1, ,0
2010,39.7981,73.6463,0,1,71,1,25,1, ,55.9015,2,0,0, , , , , , , ,1, , ,0,1,2,0,1,0, ,70.2,19.0997,29.1867,25,1,0,0,0, ,1
2010, , ,0,0,52,1,28,2, ,9.7589,0,0,0, , , , , , , ,2, , ,0,1,0,0,1,2,99,70.2,10.4585,18.0485,28,0,0,0,0, ,1
2010,8.897,24.8911,0,0,68,1,42,2, ,14.9488,1,0,0, , , , , , , ,1, ,2,0,3,2,0,1,2,109,69,19.8526,23.5672,42,0,1,0,1, ,0
2010,10.8757,41.1527,0,1,62,0,25,0, , ,0,0,0, , , , , , , ,1, , ,0, ,1,0,1, ,101,70.2,20.0953,23.8851,25,0,1,0,1, ,1
2010,34.0998,47.3428,1,2,50,1,29,2, ,181.9124,3,1,3, , , , , , , ,2, , ,0,1,0,0,1,0,41,57.03,19.8164,22.5258,29,1,2,0,1, ,1
2010,17.9465,50.1025,0,1,80, ,32, , ,13.4382,0,0,0, , , , , , , ,1, , ,0,0,0,0,1, ,118,66,16.9023,28.9931,32,1,1,0,0, ,1
2010,30.8122,60.3203,1,1,57,1,26,2, ,449.4009,2,0,0, , , , , , , ,1, , ,0,3,3, ,1,2, ,52.5,8.8549,15.7872,26,0,1,0,1, ,0
2010,19.8887,47.9065,0,1,59,1,40,2, ,77.013,2,0,2, , , , , , , ,1, , ,0,0,3,0,1,2,91,69,17.808,23.8283,40,1,0,0,0, ,0
2010,8.8475,25.1332,1,1,63,1,39,2, ,90.0106,1,0,1, , , , , , , ,1, , ,0,3,0,0,1,1, ,69,11.9884,7.2707,39,0,1,0,1, ,0
2010,17.1761,39.3962,1,1,65,1,35,2, , ,1,0,1, , , , , , , ,1, ,1,0,1,0,0,1,0, ,69,14.9532,15.4982,35,1,1,0,0, ,1
2010,11.5915,26.0731,1,1,64,1,37,2, ,68.799,2,0,0, , , , , , , ,1, ,2,0,0,2,0,1,2,81,69,18.3895,23.3426,37,1,1,0,0, ,0
2010,25.0058,47.4013,0,1,44,1,34,2, ,177.2289,2,0,1, , , , , , , ,1, ,1,0,3,3,0,1,3, ,61.05,19.2848,31.5507,34,1,1,0,0, ,0
2010,10.9235,34.9477,0,0,74, ,28, , ,4.1943,0,0,0, , , , , , , ,1, ,1,0,0,0,0, ,2,86,70.2,10.6221,16.8629,28,0,0,0,0, ,1
2010,11.2619,32.1332,1,1,71,1,40,2, ,53.3123,0,0,0, , , , , , , ,1, ,1,0,3,1,0,1,2,70,69,16.9959,19.0634,40,0,0,0,0, ,0
2014,26.7265,68.5147,1,0,77,1,28,1, ,32.4383,0,0,0,1.8,44,79.2, , , ,93.456,2, ,1,0,3,1,0,1,0,100,70.2,12.3116,20.0845,28,0,0,0,0, ,1
2010,20.3249,66.2597,0,2,60, ,33, , ,43.7765,2,0,0, , , , , , , ,1, ,2,0,1,0,0,1, ,80,66,16.8052,25.2441,33,0,0,0,0, ,0
2010,13.1639,47.0561,0,1,67,1,41,2, ,9.2554,2,0,1, , , , , , , ,1, ,1,0,0,2,0,1,0,99,69,17.9348,20.4897,41,0,1,0,1, ,0
2010,25.0949,50.0762,0,0,51,1,36,2, ,220.7651,3,1,2, , , , , , , ,1, ,2,0,3,3,0,1,2,75,67,19.9939,28.728,36,0,1,0,1, ,0
2010,38.3411,67.611,1,2,76, ,25, , ,109.8948,1,0,0, , , , , , , ,1, ,2,0,3,2,0,1,2, ,70.2,19.1667,30.8373,25,2,1,0,0, ,1
2010,6.7468,33.9612,0,0,62,1,37,2, ,23.5806,1,0,1, , , , , , , ,1, ,2,0,1,2,0,1,2, ,69,18.4348,16.4325,37,0,0,0,0, ,1
2010,34.447,59.0653,0,1,62,1,21,1, ,112.4668,2,0,0, , , , , , , ,1, ,1,0,3,3,0,1,0,92,54,21.0081,41.9743,21,0,0,0,0, ,0
2010,35.8486,79.2183,1,1,82,1,25,2, ,273.119,1,0,0, , , , , , , ,1, ,1,0,3,2,0,1,2,81,70.2,19.7633,30.7796,25,0,0,0,0, ,0
2010,12.3823,46.4948,1,0,54,1,35,2, ,51.7445,1,0,1, , , , , , , ,1, ,1,0, ,2,0,1, ,83,69,12.3803,15.0909,35,0,0,0,0, ,0
2010,16.6289,42.2984,0,0,68,1,28,2, ,75.0389,1,0,1,4,5,20, , , ,28,2, ,1,0,3,0,0,1,2, ,55,24.3256,22.7676,28,0,0,0,0, ,1
2010,31.6275,48.316,1,2,66,1,32,2, ,82.4804,3,1,3, , , , , , , ,1, ,1,0,2,3,0,1,3,58.5,63,20.0553,29.146,32,0,1,0,1, ,1
2010,6.925,22.571,0, ,69,0,25,0, ,5.5962,2,0,0, , , , , , , ,1, ,1,0,1,0,0, ,2,62,70.2,14.599,24.7965,25,1,2,0,1, ,1
2010,6.161,15.9574,1,0,82,1,37,2, ,24.2786,2,0,2, , , , , , , ,1, ,1,0,2,1,0,1,2,115,69,14.8638,18.459,37,0,0,0,0, ,1
2010,31.2773,48.4764,1,2,57,1,33,2, ,1075.4356,1,0,1, , , , , , , ,1, ,2,0,3,0,0,1,2, ,63,19.3449,21.4853,33,1,1,0,0, ,1
2010,49.0148,75.0215,1,1,69,1,24,1, ,37.1962,2,0,0, , , , , , , ,1, ,2,0,1,3,0,1,0, ,68.4,18.9173,39.1051,24,0,1,0,1, ,1
2010,16.3059,49.0914,1,1,72,1,37,2, ,110.8875,3,1,0, , , , , , , ,1, ,1,0, , , ,1, ,73,69,18.9586,22.7613,37,0,1,0,1, ,0
2010,10.9659,58.019,1,0,67,0,27,0, ,92.0506,1,0,0, , , , , , , ,1, ,1,0,1,0,0,1,2,37,70.2,14.114,19.5759,27,1,1,0,0, ,0
2010,9.8541,23.4926,0,1,71,1,36,2, ,96.0445,1,0,1, , , , , , , ,1, ,1,0,3,2,0,1,2,104,69,11.6558,8.4188,36,0,0,0,0, ,1
2010, , ,1,1,88,1,27,1, , ,2,0,0, , , , , , , ,1, ,1,0,3,1,0,1,2, ,70.2, , ,27,1,3,1,1, ,0
2010,17.0472,49.2132,1,1,76,1,34,2, ,54.9145,1,0,1, , , , , , , ,1, ,1,0, , , ,1, , ,65,19.5654,30.127,34,1,1,0,0, ,1
2010,20.1625,55.5961,1,1,83,0,33,0, ,121.3102,1,0,0, , , , , , , ,1, ,1,0,1,0,0,1,0,65.8,80.4,19.9091,29.7224,33,0,2,0,1, ,0
2010,21.3502,46.6747,1,2,73,1,35,2, ,82.9353,4,1,0, , , , , , , ,1, ,1,0,3,2,0,1,2, ,69,30.378,22.3199,35,2,3,1,1, ,0
2010,2.7626,9.8551,0,2,51, ,40, , ,95.1862,1,0,0, , , , , , , ,1, ,1,0,3,0,0,1, ,117,69.05,5.6537,5.3015,40,0,1,0,1, ,0
2010, , ,1,1,65, ,33, , , ,2,0,2, , , , , , , ,1, ,2,0,2,2,0,1, ,59,61.02, , ,33,1,1,0,0, ,0
2010,25.9227,51.3165,1,3,80,1,20,1, ,29.7289,3,1,1, , , , , , , ,1, ,1,0,0,3,0,1,0, ,54,19.8801,42.621,20,1,2,0,1, ,0
2010,15.1488,41.7363,1,1,67,1,38,2, ,492.5251,1,0,1, , , , , , , ,1, ,1,0,3,0,0,1, ,46,69,15.9103,15.684,38,1,1,0,0, ,0
2010,11.5709,25.669,0,2,54,1,41,2, ,98.5937,2,0,0, , , , , , , ,1, ,2,0,0,3,0,1,2, ,68.99,13.3726,7.7437,41,1,1,0,0, ,0
2010,14.8465,45.8829,1,1,48,1,22,2, ,69.5601,2,0,0, , , , , , , ,1, ,2,0,1,2,0,1,0,120,45,9.2537,16.0269,22,1,1,0,0, ,0
2010,20.6346,67.8566,1,0,76,1,25,1, ,9.2583,1,0,0, , , , , , , ,2, ,1,0,2, ,0,1,2,62,70.2,14.8877,26.6613,25,0,0,0,0, ,1
2010,37.2418,66.5611,1,2,77,1,25,1, ,21.6551,1,0,0, , , , , , , ,1,0,0,0,0,3,0,1,0,33,63,20.6129,44.6905,25,2,1,0,0, ,0
2010,39.0906,67.4511,0,2,58,1,23,1, ,74.3065,3,1,0, , , , , , , ,1,0,0,0,1,2,0,1,1,95,63,20.0297,0.2402,23,1,1,0,0, ,0
2010,12.0697,48.1356,1,2,78,1,27,1, ,72.9933,0,0,0, , , , , , , ,1, ,1,0,1,2,0,1,2,88,70.18,15.6675,25.3112,27,2,2,0,0, ,0
2010,11.7907,42.5534,1,1,84,1,35,2, ,129.2782,1,0,0, , , , , , , ,1, ,1,0,2,2,0,1,2,117,69,24.0317,24.2684,35,0,1,0,1, ,0
2010,18.174,41.2267,1,2,62,1,37,2, ,461.1425,3,1,0, , , , , , , ,1, ,2,0,2,2,0,1,2,84,69,18.5389,25.8815,37,1,2,0,1, ,0
2010,17.4998,50.9285,0,1,71,1,36,2, ,15.5125,2,0,2, , , , , , , ,1, ,2,0,3,0,0,1, ,50,69,8.9491,10.6225,36,1,1,0,0, ,1
2010,12.6655,48.0186,1,2,73,1,37,2, ,17.0374,1,0,1, , , , , , , ,1, ,2,0,3,0,0,1,0, ,69,9.5804,10.05,37,0,0,0,0, ,1
2010,19.3408,71.8859,0,1,77,0,33,0, ,116.3607,1,0,0, , , , , , , ,1, ,2,0,2,0,0,1,2,72,95.52,10.1828,15.7708,33,1,1,0,0, ,0
2010,24.9989,48.9772,1,1,64,1,41,2, , ,2,0,1, , , , , , , ,1, ,1,0,3,2,0,1, ,78,69,18.2873,19.2946,41,1,1,0,0, ,1
2010,21.6953,48.3653,1,0,58,1,35,2, ,77.4965,0,0,0, , , , , , , ,1, ,1,0,0,2,0,1,0,30,67,19.8174,23.1058,35,1,1,0,0, ,1
2010,24.8625,62.078,1,3,88, ,27, , ,27.0653,1,0,0, , , , , , , ,1, ,1,0,3,0,0,1,2, ,70.2,14.2232,22.999,27,3,3,1,0, ,1
2010,28.2959,46.4022,0,1,54,1,3,2, ,166.1911,0,0,0, , , , , , , ,1, ,2,0, ,3,0,1,2,78,9,13.8904,29.237,3,1,1,0,0, ,1
2010,22.8078,56.21,0,0,88, ,28, , ,210.7801,0,0,0, , , , , , , ,1,0,0,0,3,0,0,1, ,88,57.75,20.0317,35.4298,28,0,0,0,0, ,0
2010,14.6513,53.5018,1,0,78,0,27,0, ,8.2769,1,0,0, , , , , , , ,1, ,1,0,0,1,0,1,0,55,70.2,11.9615,20.9566,27,1,1,0,0, ,1
2010,11.5518,70.6322,1, ,71,0,25,0, ,61.6179,1,0,0, , , , , , , ,1, ,2,0,1,1,0,1,2, ,70.2,14.3824,22.0535,25,1,1,0,0, ,1
2010,21.2262,19.442,1,3,85,0,31,0, ,36.0861,0,0,0, , , , , , , ,1, ,1,0,1,0,0,1, ,84,66,11.6449,0.0069,31,0,1,0,1, ,0
2010,10.5465,24.5297,1,1,72,1,33,2, ,172.3909,1,0,1, , , , , , , ,1, ,1,0,2,2,0,1,2,56,69.12,11.4012,7.6007,33,0,1,0,1, ,1
2010,5.5318,32.0371,0,2,78,0,31,0, ,7.1468,1,0,0, , , , , , , ,1, ,1,0,2,0,0,1,0,51,66,13.7503,25.7653,31,2,0,0,0, ,0
2010,28.9361,45.5425,0,1,59,1,38,2, ,485.1036,1,0,1, , , , , , , ,1, ,1,0,3,2,0,1,2,64,65.06,20.8416,22.4611,38,2,1,0,0, ,1
2010, , ,0,1,67,1,33,2, , ,3,1,2, , , , , , , ,1, ,0,0,3,3,0,1,2,79.8,65, , ,33,1,1,0,0, ,0
2011, , ,0,2,75, ,29, , , ,3,1,0, , , , , , , ,1, ,1,0, ,2,0,1, , ,68.55, , ,29,1,3,1,1, ,0
2010,20.5347,58.5292,0,1,78,1,27,1, ,19.3548,1,0,0, , , , , , , ,1,0.5,2,0,0,2,0,1,2,87,70.2,20.1083,38.3791,27,1,1,0,0, ,1
2010,39.4969,51.0605,1,1,65,1,22,2, ,520.4229,1,0,1, , , , , , , ,1, ,1,0,3,3,0,0,2, ,45,16.448,27.0285,22,1,1,0,0, ,0
2010, , ,0,1,68,1,36,2, , ,2,0,2, , , , , , , ,1, ,1,0,3,2,0,1,2,95,69.05, , ,36,1,1,0,0, ,0
2010, , ,1,0,63,1,31,2, , ,3,1,3, , , , , , , ,1, ,1,0,3,2,0,1,2,103,79.92, , ,31,0,0,0,0, ,0
2010, , ,1,0,58,1,36,2, , ,2,0,2, , , , , , , ,1, ,2,0,3,3,0,1,2,25,69, , ,36,1,1,0,0, ,0
2010,4.6147,23.1953,1,1,81,1,28,2, , ,1,0,1, , , , , , , ,1, ,1,0,0,0,0,1,2,86,55.5,2.8529,3.638,28,0,2,0,1, ,0
2010,24.8284,52.7808,1,0,68,0,25,0, ,83.5476,1,0,0, , , , , , , ,1,1,2,0,3,0,0, ,0,49,70.24,17.0746,26.5205,25,0,1,0,1, ,1
2010,4.0929,11.5021,0,0,57,1,38,2, ,37.9887,0,0,0, , , , , , , ,1, ,1,0,2,3,0,1,2,81,69,11.0363,11.9227,38,0,0,0,0, ,1
2010,15.1482,45.5169,1,1,74,1,36,2, ,4.7464,2,0,0, , , , , , , ,1, ,2,0,2,2,0,1,2,88,69,11.9239,14.6023,36,0,1,0,1, ,0
2010,14.7212,40.3711,0,1,69,0,27,0, ,36.4695,2,0,0, , , , , , , ,1, ,1,0,1,0,0,1,2,50,70.2,32.0999,27.7332,27,2,1,0,0, ,1
2010,14.8346,46.3988,1,3,82, ,29, , ,25.1169,0,0,0, , , , , , , ,1, ,1,0,1,0,0,1,0,52,79.2,15.8995,26.2755,29,2,3,1,1, ,0
2010,4.7575,16.4077,0,1,73,0,29,0, ,64.0984,0,0,0, , , , , , , ,1, ,1,0,1,0,0,1,0,75,79.2,12.0576,18.7214,29,1,1,0,0, ,0
2010,20.5028,64.8843,0,1,73, ,27, , ,28.985,1,0,0, , , , , , , ,1, ,1,0,1,0,0,1,0,64,70.2,19.5414,34.1663,27,0,0,0,0, ,0
2010,31.6403,59.811,1,2,73, ,28, , , , , ,2, , , , , , , ,1, ,1,0, ,3,0,1, , ,57.75,15.784,31.3759,28,2,2,0,0, ,0
2010,27.068,65.5458,1,1,72, ,31, , ,57.3063,0,0,0, , , , , , , ,1, ,2,0,3,0,0,1, ,111,66,13.5068,24.0612,31,0,1,0,1, ,1
2010,11.0975,45.8251,1,0,73, ,37, , ,177.3291,2,0,2, , , , , , , ,1, , ,0,2,2,0,1, ,102,69,18.4969,22.3442,37,0,0,0,0, ,0
2010, , ,0,1,62, ,38, , ,32.3181,1,0,0, , , , , , , ,1, ,2,0,1,2, ,1,0, ,69,16.4974,21.2309,38,1,1,0,0, ,0
2010,11.9243,42.1435,1,1,67,1,38,2, ,46.8636,1,0,0, , , , , , , ,1, ,1,0,3,0,0,1,2,55,69,14.0917,18.2009,38,0,1,0,1, ,0
2010,13.0091,25.2053,0,1,61,1,36,2, ,62.8939,3,1,2, , , , , , , ,1, ,1,0,3,2,0,1,2,74,67,13.0636,8.0663,36,1,2,0,1, ,0
2010,19.5284,45.7125,0,0,51, ,35, , ,36.4151,2,0,2, , , , , , , ,1, ,2,0,2,2,0,1, , ,69,14.3623,17.5589,35,2,1,0,0, ,0
2010,13.3177,40.9081,1,1,70,1,39,2, ,61.0828,1,0,1, , , , , , , ,1, ,2,0,1,1,0,1,1, ,69,25.8722,25.227,39,1,1,0,0, ,0
2011,7.6458,36.1876,1,1,76, ,33, , ,22.4533,0,0,0, , , , , , , ,1, ,1,0,1,0,0,1,0,60,66,13.3732,22.2042,33,1,1,0,0, ,0
2010,16.3482,46.601,1,1,65, ,33, , ,156.4465,3,1,3, , , , , , , ,1, ,1,0,3,2,0,1, ,68,69,18.0357,22.2304,33,1,1,0,0, ,0
2010,27.3164,48.6095,0,2,58,1,35,2, , ,3,1,1, , , , , , , ,1, ,1,0, ,3, ,1, , ,65.21,18.7998,20.1941,35,1,1,0,0, ,1
2010,11.9741,41.9588,1,1,54, ,27, , ,145.3829,1,0,0, , , , , , , ,1, ,1,0,1,0,0,1,0,64,55,19.633,33.7178,27,1,1,0,0, ,0
2010, , ,1,0,67, ,35, , ,177.8326,3,1,2, , , , , , , ,1, ,1,0,3,1, ,1, ,91,67,26.0762,22.9713,35,0,0,0,0, ,1
2010,4.0906,16.6957,1,0,73, ,18, , ,19.5436,0,0,0, , , , , , , ,1, ,1,0,1,1,0,1,0,60,69,9.7966,5.7832,18,0,1,0,1, ,1
2010,25.4319,65.835,0,0,62, ,27, , ,56.9544,2,0,0, , , , , , , ,1, ,2,0,1,2,0,1, ,66,70.2,15.1026,22.9321,27,2,2,0,0, ,0
2010,26.5786,68.0154,0,1,68, ,27, , ,29.0966,1,0,0, , , , , , , ,1, ,1,0,1,0,0, ,0,105,70.24,19.8263,28.8744,27,1,1,0,0, ,1
2011,28.2969,66.17,0, ,82, ,1, , ,45.084, , ,1, , , , , , , ,1, ,1,0,1,0,0,1,0, ,66,14.4394,24.6552,1,0,1,0,1, ,0
2011,35.8391,63.2784,1,1,77,0,10,0, ,135.9444,0,0,0, , , , , , , ,1, ,2,0,1,2,0,1,1, ,27.5,21.386,28.934,10,2,2,0,0, ,0
2011,27.994,64.6775,1,2,76,1,31,2, ,111.7115,2,0,0, , , , , , , ,1, ,2,0,3,2,0,1,2,86.9,80.91,15.6013,26.3092,31,1,1,0,0, ,1
2011, , ,1,1,70,1,27,1, , ,1,0,0, , , , , , , ,1, ,1,0,3,2,0,1,2, ,70.25, , ,27,1,1,0,0, ,0
2011,27.7852,31.843,1,3,80, ,11, , ,275.7282,2,0,0, , , , , , , ,0, ,1,0,1,2,0,1,0, ,30,10.5469,20.5557,11,1,1,0,0, ,0
2011,17.0718,64.0624,1,2,77,1,27,1, ,38.3177,0,0,0, , , , , , , ,1, ,2,0,3,0,0,1,2, ,70.2,13.9219,22.939,27,1,1,0,0, ,1
2011, , ,1,1,73,1,38,2, , ,0,0,0, , , , , , , ,1,0,0,0,2,2,0,1,2,59,69, , ,38,0,1,0,1, ,1
2011,12.73,58.3339,0,2,71, ,33, , ,46.8979,1,0,0, , , , , , , ,1, ,2,0,1,1,0,1, ,95,66,16.749,26.8467,33,0,0,0,0, ,0
2011,30.2071,48.6215,1,2,57,1,33,2, , ,2,0,2, , , , , , , ,1, ,2,0,3,2,0,1,2,65,63,20.2793,26.5256,33,0,1,0,1, ,0
2011,41.6299,68.1406,1,4,69,0,33,0, ,342.7591,2,0,0, , , , , , , ,1, ,1,0,3,0,0,1,3, ,65.13, , ,33,3,3,1,0, ,0
2014,11.087,52.0532,0,0,50,0,27,0, ,7.1697,1,0,1,3,17,51, , , ,66.3,2, ,2,0,0,1,0, ,2,72,70.2,13.5414,21.3726,27,0,0,0,0, ,1
2011,15.3397,61.1281,0,2,84,0,27,0, ,11.8618,0,0,2, , , , , , , ,1, ,1,0,0,0,0, ,2,60,70.2,13.5276,22.2222,27,0,2,0,1, ,0
2011,33.8032,64.9789,1,2,61, ,35, , ,204.3514,3,1,0, , , , , , , ,1, ,1,0,0,3,0,1,1,82,78.37,22.0064,38.4086,35,1,1,0,0, ,0
2011,36.4263,47.5926,0,1,64,1,35,2, ,65.9266,2,0,1, , , , , , , ,1, ,1,0,0,3,0,1,2,77,67,20.1985,25.253,35,1,1,0,0, ,0
2011,28.1087,65.191,1,0,62,1,33,2, ,261.5948,0,0,0, , , , , , , ,1, ,1,0,3,3, ,1,2,117,72.58,18.9887,32.6077,33,0,0,0,0, ,1
2011,34.1273,46.0388,0,1,75,1,29,2, ,79.2475,2,0,2, , , , , , , ,1, ,2,0,2,3,0,1,1,96,53,21.1766,38.8475,29,0,1,0,1, ,0
2011,3.9417,23.2551,1,2,83,0,25,0, ,9.6159,0,0,0, , , , , , , ,1, ,1,0,0,0,0, ,2,76,70.2,7.6014,11.0298,25,2,2,0,0, ,0
2011,24.7208,48.2959,1,0,76,1,37,2, ,46.9522,2,0,2, , , , , , , ,1, ,1,0,1,3, ,1,2,84,69,26.2826,25.6473,37,0,0,0,0, ,1
2011,29.5871,45.2675,1,2,49,1,36,2, , ,3,1,1, , , , , , , ,1,0.5,1,0, , , ,1, ,57,69,9.9172,0.9981,36,2,1,0,0, ,0
2011,35.6537,51.371,1,0,77,1,28,2, ,176.7454,3,1,2, , , , , , , ,1, ,2,0,3,3,0,1,2,71,57.06,20.0051,28.6713,28,0,0,0,0, ,0
2011,26.1223,48.4848,0,0,66,1,36,2, ,38.1403,3,1,1, , , , , , , ,1, ,2,0,0,3,0,1,2,82,67.03,19.7227,26.1736,36,1,1,0,0, ,0
2011,16.0677,43.181,0,0,59,1,33,2, ,58.8856,1,0,0, , , , , , , ,1, ,2,0,3,0,0,1, ,77,69,20.623,21.7426,33,0,0,0,0, ,1
2011,26.4473,50.9885,1,1,65,1,35,2, ,72.2523,3,1,1, , , , , , , ,1, ,1,0,1,3,0,1,0,84,69,26.2966,21.8913,35,1,1,0,0, ,0
2011,14.154,48.2367,1,1,76,1,33,2, ,36.1261,1,0,1, , , , , , , ,1, ,1,0,1,2,0,1,2,89,68.6,18.4492,24.3538,33,1,0,0,0, ,1
2011,27.9333,70.0143,1,1,80,1,28,1, ,84.0197,1,0,0, , , , , , , ,1, ,1,0,3,2,0,1,2,92,70.2,15.3723,27.5114,28,0,0,0,0, ,1
2011, , ,1,3,72,1,40,2, , ,1,0,1, , , , , , , ,1, ,1,0,0,2,0,1,1,95,69, , ,40,2,1,0,0, ,1
2011,46.066,67.4768,1,1,72,1,30,2, ,668.3636,2,0,0, , , , , , , ,1, ,1,0,2,3,0,1,2,108,63.25,21.4957,35.7087,30,1,1,0,0, ,1
2011,35.7421,73.9802,1,1,75,1,27,1, ,55.2034,1,0,0, , , , , , , ,1, ,1,0, , , ,1,0,69,70.2, ,33.7946,27,2,0,0,0, ,0
2011,17.4119,47.9322,1,1,68,1,30,2, ,37.7655,2,0,1, , , , , , , ,1, ,1,0,1,3,0,1,2,82,61,20.1454,31.1785,30,1,1,0,0, ,1